Reaction Details
Target5-hydroxytryptamine receptor 5A
LigandBDBM81498
Substrate/Competitorn/a
Ki 316.22±n/a nM
CommentsPDSP_1643
Citation Plassat, JLBoschert, UAmlaiky, NHen, R The mouse 5HT5 receptor reveals a remarkable heterogeneity within the 5HT1D receptor family. EMBO J11:4779-86 (1992) 5-hydroxytryptamine receptor 5A
Name:5-hydroxytryptamine receptor 5A
Type:Enzyme Catalytic Domain
Mol. Mass.:40749.33
Organism:MOUSE
Description:5-HT5 0 MOUSE::P30966
Residue:357
BDBM81498
NameBDBM81498
Synonyms:5-Methoxy-3-(1,2,3,6-tetrahydro-pyridin-4-yl)-1H-indole(RU-24969) CHEMBL18785 RU 24969
TypeSmall organic molecule
Emp. Form.C14H16N2O
Mol. Mass.228.2896
SMILESCOc1ccc2[nH]cc(C3=CCNCC3)c2c1