Reaction Details
Target5-hydroxytryptamine receptor 1E
LigandBDBM82087
Substrate/Competitorn/a
Ki 3151±n/a nM
CommentsPDSP_172
Citation Zgombick, JMSchechter, LEMacchi, MHartig, PRBranchek, TAWeinshank, RL Human gene S31 encodes the pharmacologically defined serotonin 5-hydroxytryptamine1E receptor. Mol Pharmacol42:180-5 (1992) 5-hydroxytryptamine receptor 1E
Name:5-hydroxytryptamine receptor 1E
Type:G Protein-Coupled Receptor (GPCR)
Mol. Mass.:41697.80
Organism:Homo sapiens (Human)
Description:gi_112822
Residue:365
BDBM82087
NameBDBM82087
Synonyms:2-(5-methoxy-1H-indol-3-yl)ethanamine 5-Methoxytryptamine hydrochloride tryptamine, 5-Methoxy
TypeSmall organic molecule
Emp. Form.C11H14N2O
Mol. Mass.190.2417
SMILESCOc1ccc2[nH]cc(CCN)c2c1