Reaction Details
Target5-hydroxytryptamine 1D receptor
LigandBDBM81789
Substrate/Competitorn/a
Ki 63±n/a nM
CommentsPDSP_736
Citation Weinshank, RLZgombick, JMMacchi, MJBranchek, TAHartig, PR Human serotonin 1D receptor is encoded by a subfamily of two distinct genes: 5-HT1D alpha and 5-HT1D beta. Proc Natl Acad Sci U S A89:3630-4 (1992) 
 
5-hydroxytryptamine 1D receptor
Name:5-hydroxytryptamine 1D receptor
Type:Protein
Mol. Mass.:12731.52
Organism:Bos taurus (Bovine)
Description:Q8MI13
Residue:119
BDBM81789
NameBDBM81789
Synonyms:5-CT,DP DP-5-CT NSC_156314
TypeSmall organic molecule
Emp. Form.C17H25N3O
Mol. Mass.287.3999
SMILESCCCN(CCC)CCc1c[nH]c2ccc(cc12)C(N)=O