Reaction Details
Target5-hydroxytryptamine 1D receptor
LigandBDBM50005835
Substrate/Competitorn/a
Ki 29±n/a nM
CommentsPDSP_1788
Citation Weinshank, RLZgombick, JMMacchi, MJBranchek, TAHartig, PR Human serotonin 1D receptor is encoded by a subfamily of two distinct genes: 5-HT1D alpha and 5-HT1D beta. Proc Natl Acad Sci U S A89:3630-4 (1992) 
 
5-hydroxytryptamine 1D receptor
Name:5-hydroxytryptamine 1D receptor
Type:Protein
Mol. Mass.:12731.52
Organism:Bos taurus (Bovine)
Description:Q8MI13
Residue:119
BDBM50005835
NameBDBM50005835
Synonyms:(3-[2-(dimethylamino)ethyl]-1H-indol-5-yl)-N-methylmethanesulfonamide 1-{3-[2-(dimethylamino)ethyl]-1H-indol-5-yl}-N-methylmethanesulfonamide 3-[2-(dimethylamino)ethyl]-N-methylindole-5-methanesulfonamide SUMATRIPTAN Sumax
TypeSmall organic molecule
Emp. Form.C14H21N3O2S
Mol. Mass.295.4
SMILESCNS(=O)(=O)Cc1ccc2[nH]cc(CCN(C)C)c2c1