Reaction Details
TargetD(2) dopamine receptor
LigandBDBM11638
Substrate/Competitorn/a
Ki 10±n/a nM
CommentsPDSP_1780
Citation Sokoloff, PGiros, BMartres, MPAndrieux, MBesancon, RPilon, CBouthenet, MLSouil, ESchwartz, JC Localization and function of the D3 dopamine receptor. Arzneimittelforschung42:224-30 (1992) D(2) dopamine receptor
Name:D(2) dopamine receptor
Type:Cell-surface receptors
Mol. Mass.:50647.10
Organism:Homo sapiens (Human)
Description:P14416
Residue:443
BDBM11638
NameBDBM11638
Synonyms:CHEMBL26 N-[(1-ethylpyrrolidin-2-yl)methyl]-2-methoxy-5-sulfamoylbenzamide SULPIRIDE,(-) Sulpiride, SLP US10172837, Sulpiride
TypeSmall organic molecule
Emp. Form.C15H23N3O4S
Mol. Mass.341.426
SMILESCCN1CCCC1CNC(=O)c1cc(ccc1OC)S(N)(=O)=O