Reaction Details
TargetD(3) dopamine receptor
LigandBDBM81798
Substrate/Competitorn/a
Ki 0.28±n/a nM
CommentsPDSP_1501
Citation Sokoloff, PGiros, BMartres, MPAndrieux, MBesancon, RPilon, CBouthenet, MLSouil, ESchwartz, JC Localization and function of the D3 dopamine receptor. Arzneimittelforschung42:224-30 (1992) D(3) dopamine receptor
Name:D(3) dopamine receptor
Type:n/a
Mol. Mass.:44243.43
Organism:Homo sapiens (Human)
Description:n/a
Residue:400
BDBM81798
NameBDBM81798
Synonyms:CAS_39860-99-6 Pipotiazine
TypeSmall organic molecule
Emp. Form.C24H33N3O3S2
Mol. Mass.475.667
SMILESCN(C)S(=O)(=O)c1ccc2Sc3ccccc3N(CCCN3CCC(CCO)CC3)c2c1