Reaction Details
TargetD(3) dopamine receptor
LigandBDBM81793
Substrate/Competitorn/a
Ki 1.2±n/a nM
CommentsPDSP_1848
Citation Sokoloff, PGiros, BMartres, MPAndrieux, MBesancon, RPilon, CBouthenet, MLSouil, ESchwartz, JC Localization and function of the D3 dopamine receptor. Arzneimittelforschung42:224-30 (1992) D(3) dopamine receptor
Name:D(3) dopamine receptor
Type:n/a
Mol. Mass.:44243.43
Organism:Homo sapiens (Human)
Description:n/a
Residue:400
BDBM81793
NameBDBM81793
Synonyms:CAS_316-81-4 Thioproperazine
TypeSmall organic molecule
Emp. Form.C22H30N4O2S2
Mol. Mass.446.629
SMILESCN(C)S(=O)(=O)c1ccc2Sc3ccccc3N(CCCN3CCN(C)CC3)c2c1