Reaction Details
TargetDipeptidase 1
LigandBDBM50297387
Substrate/Competitorn/a
Ki 1.53±n/a nM
CommentsPDSP_1117
Citation Shirley, JTCheng, JB Competition of leukotrienes and ICI-198,615 for [3H]LTD4 binding sites in guinea pig lung membranes suggests the involvement of two LTD4 receptor subtypes. J Pharmacol Exp Ther258:531-6 (1991) Dipeptidase 1
Name:Dipeptidase 1
Type:Enzyme Catalytic Domain
Mol. Mass.:44697.32
Organism:GUINEA PIG
Description:Leukotriene D4 Alpha 0 GUINEA PIG::P22412
Residue:409
BDBM50297387
NameBDBM50297387
Synonyms:(5S,6R,7E,9E,11Z,14Z)-6-(cystein-S-yl)-5-hydroxyicosa-7,9,11,14-tetraenoic acidS-{(1R,2E,4E,6Z,9Z)-1-[(1S)-4-carboxy-1-hydroxybutyl]pentadeca-2,4,6,9-tetraen-1-yl}-L-cysteine 5S-hydroxy,6R-(S-cysteinyl),7E,9E,11Z,14Z-eicosatetraenoic acid LTE4 | leukotriene E4
TypeSmall organic molecule
Emp. Form.C23H37NO5S
Mol. Mass.439.609
SMILESCCCCC\C=C/C\C=C/C=C/C=C/[C@@H](SC[C@H](N)C(O)=O)[C@@H](O)CCCC(O)=O