Reaction Details
TargetCysteinyl leukotriene receptor 2
LigandBDBM50009075
Substrate/Competitorn/a
Ki 6.89±n/a nM
CommentsPDSP_953
Citation Shirley, JTCheng, JB Competition of leukotrienes and ICI-198,615 for [3H]LTD4 binding sites in guinea pig lung membranes suggests the involvement of two LTD4 receptor subtypes. J Pharmacol Exp Ther258:531-6 (1991) Cysteinyl leukotriene receptor 2
Name:Cysteinyl leukotriene receptor 2
Type:Enzyme Catalytic Domain
Mol. Mass.:36091.77
Organism:GUINEA PIG
Description:Q2NNR4
Residue:317
BDBM50009075
NameBDBM50009075
Synonyms:CHEMBL22033 ICI-198615 [1-(4-Benzenesulfonylaminocarbonyl-2-methoxy-benzyl)-1H-indazol-6-yl]-carbamic acid cyclopentyl ester [1-(4-Benzenesulfonylaminocarbonyl-2-methoxy-benzyl)-1H-indazol-6-yl]-carbamic acid cyclopentyl ester(ICI 198, 615) | [1-(4-Benzenesulfonylaminocarbonyl-2-methoxy-benzyl)-1H-indazol-6-yl]-carbamic acid cyclopentyl ester(ICI 198615)
TypeSmall organic molecule
Emp. Form.C28H28N4O6S
Mol. Mass.548.61
SMILESCOc1cc(ccc1Cn1ncc2ccc(NC(=O)OC3CCCC3)cc12)C(=O)NS(=O)(=O)c1ccccc1