Reaction Details
TargetAurora kinase A
LigandBDBM106152
Substrate/Competitorn/a
Meas. Tech.Acetyl-Histone Binding Assay
pH7.5±n/a
Temperature298.15±n/a K
IC50>10000±0.0 nM
Commentsextracted
Citation Bradner, JEGray, NSQi, JMcKeown, MRBuckley, D Diazepane derivatives and uses thereof US Patent US9695172 Publication Date 7/4/2017
 
Aurora kinase A
Name:Aurora kinase A
Type:Serine/threonine-protein kinase
Mol. Mass.:45830.98
Organism:Homo sapiens (Human)
Description:O14965
Residue:403
BDBM106152
NameBDBM106152
Synonyms:US9695172, 2-221
TypeSmall organic molecule
Emp. Form.C20H19N5O3S
Mol. Mass.409.462
SMILESCN1c2ccccc2C(=O)N(C)c2ccc(Nc3ccc(cc3)S(N)(=O)=O)nc12