Reaction Details
TargetBromodomain testis-specific protein
LigandBDBM50365262
Substrate/Competitorn/a
Meas. Tech.Acetyl-Histone Binding Assay
pH7.5±n/a
Temperature298.15±n/a K
IC50 147±0.0 nM
Commentsextracted
Citation Bradner, JEGray, NSQi, JMcKeown, MRBuckley, D Diazepane derivatives and uses thereof US Patent US9695172 Publication Date 7/4/2017
 
Bromodomain testis-specific protein
Name:Bromodomain testis-specific protein
Type:PROTEIN
Mol. Mass.:107982.01
Organism:Homo sapiens (Human)
Description:ChEMBL_1502985
Residue:947
BDBM50365262
NameBDBM50365262
Synonyms:(+)-JQ1 CHEMBL1957266 US10124009, Compound (S)-JQ1 US10308662, Compound JQ-1 US10617680, Example JQ-1 US10925881, Name (S)-JQ1 US11078188, Example (+)-JQ1 US11427593, Compound JQ1 US9320741, (S)-JQ1 | US9695172, JQ1
TypeSmall organic molecule
Emp. Form.C23H25ClN4O2S
Mol. Mass.456.988
SMILESCc1nnc2[C@H](CC(=O)OC(C)(C)C)N=C(c3c(C)c(C)sc3-n12)c1ccc(Cl)cc1