Reaction Details
TargetGamma-aminobutyric acid receptor subunit alpha-1
LigandBDBM22032
Substrate/Competitorn/a
Ki 3±n/a nM
CommentsPDSP_1506
Citation Awad, MGavish, M Peripheral-type benzodiazepine receptors in human cerebral cortex, kidney, and colon. Life Sci49:1155-61 (1991) 
 
Gamma-aminobutyric acid receptor subunit alpha-1
Name:Gamma-aminobutyric acid receptor subunit alpha-1
Type:Enzyme
Mol. Mass.:51770.21
Organism:Rattus norvegicus (Rat)
Description:P62813
Residue:455
BDBM22032
NameBDBM22032
Synonyms:1-(2-chlorophenyl)-N-methyl-N-(1-methylpropyl)isoquinoline-3-carboxamide N-(butan-2-yl)-1-(2-chlorophenyl)-N-methylisoquinoline-3-carboxamide PK-11195 RP 52028 | [3H]PK 11195
Typeradiolabeled ligand
Emp. Form.C21H21ClN2O
Mol. Mass.352.857
SMILESCCC(C)N(C)C(=O)c1cc2ccccc2c(n1)-c1ccccc1Cl