Reaction Details
TargetAlpha-2A adrenergic receptor
LigandBDBM66983
Substrate/Competitorn/a
Ki 2.4±n/a nM
CommentsPDSP_1727
Citation Blaxall, HSMurphy, TJBaker, JCRay, CBylund, DB Characterization of the alpha-2C adrenergic receptor subtype in the opossum kidney and in the OK cell line. J Pharmacol Exp Ther259:323-9 (1991) Alpha-2A adrenergic receptor
Name:Alpha-2A adrenergic receptor
Type:Enzyme
Mol. Mass.:48979.91
Organism:Homo sapiens (Human)
Description:P08913
Residue:450
BDBM66983
NameBDBM66983
Synonyms:6-chloranyl-3-methyl-1,2,4,5-tetrahydro-3-benzazepine;hydrochloride CHEMBL123349 SKF 86466 SMR001254100 | cid_10220250
TypeSmall organic molecule
Emp. Form.C11H14ClN
Mol. Mass.195.689
SMILESCN1CCc2cccc(Cl)c2CC1