Reaction Details
TargetAlpha-2B adrenergic receptor
LigandBDBM81809
Substrate/Competitorn/a
Ki 0.68±n/a nM
CommentsPDSP_344
Citation Blaxall, HSMurphy, TJBaker, JCRay, CBylund, DB Characterization of the alpha-2C adrenergic receptor subtype in the opossum kidney and in the OK cell line. J Pharmacol Exp Ther259:323-9 (1991) Alpha-2B adrenergic receptor
Name:Alpha-2B adrenergic receptor
Type:Enzyme Catalytic Domain
Mol. Mass.:50379.83
Organism:NEONATAL RAT
Description:adrenergic Alpha2B ADRA2B NEONATAL RAT::P19328
Residue:453
BDBM81809
NameBDBM81809
Synonyms:BE-2254 NSC_34772
TypeSmall organic molecule
Emp. Form.C19H21NO2
Mol. Mass.295.3755
SMILESOc1ccc(CCNCC2CCc3ccccc3C2=O)cc1