Reaction Details
TargetAlpha-2B adrenergic receptor
LigandBDBM81811
Substrate/Competitorn/a
Ki 0.26±n/a nM
CommentsPDSP_1050
Citation Blaxall, HSMurphy, TJBaker, JCRay, CBylund, DB Characterization of the alpha-2C adrenergic receptor subtype in the opossum kidney and in the OK cell line. J Pharmacol Exp Ther259:323-9 (1991) Alpha-2B adrenergic receptor
Name:Alpha-2B adrenergic receptor
Type:Enzyme Catalytic Domain
Mol. Mass.:50379.83
Organism:NEONATAL RAT
Description:adrenergic Alpha2B ADRA2B NEONATAL RAT::P19328
Residue:453
BDBM81811
NameBDBM81811
Synonyms:CAS_123679 MK-912 | NSC_123679
TypeSmall organic molecule
Emp. Form.C20H25N3O2
Mol. Mass.339.4314
SMILESCN1CCC2(CCN3CCc4c(oc5ccccc45)C3C2)N(C)C1=O