Reaction Details
TargetAlpha-2B adrenergic receptor
LigandBDBM30993
Substrate/Competitorn/a
Ki 1.5±n/a nM
CommentsPDSP_1805
Citation Blaxall, HSMurphy, TJBaker, JCRay, CBylund, DB Characterization of the alpha-2C adrenergic receptor subtype in the opossum kidney and in the OK cell line. J Pharmacol Exp Ther259:323-9 (1991) Alpha-2B adrenergic receptor
Name:Alpha-2B adrenergic receptor
Type:Enzyme Catalytic Domain
Mol. Mass.:50379.83
Organism:NEONATAL RAT
Description:adrenergic Alpha2B ADRA2B NEONATAL RAT::P19328
Residue:453
BDBM30993
NameBDBM30993
Synonyms:Ajmalicine Raubasine cid_251561
TypeSmall organic molecule
Emp. Form.C21H24N2O3
Mol. Mass.352.4269
SMILESCOC(=O)C1=COC(C)C2CN3CCc4c([nH]c5ccccc45)C3CC12