Reaction Details
TargetAlpha-2C adrenergic receptor
LigandBDBM81804
Substrate/Competitorn/a
Ki 0.08±n/a nM
CommentsPDSP_343
Citation Blaxall, HSMurphy, TJBaker, JCRay, CBylund, DB Characterization of the alpha-2C adrenergic receptor subtype in the opossum kidney and in the OK cell line. J Pharmacol Exp Ther259:323-9 (1991) Alpha-2C adrenergic receptor
Name:Alpha-2C adrenergic receptor
Type:Enzyme Catalytic Domain
Mol. Mass.:27257.01
Organism:OK
Description:adrenergic Alpha2C ADRA2C OK::G3GWB4
Residue:230
BDBM81804
NameBDBM81804
Synonyms:4-chloro-2-(2-imidazolin-2-ylamino)isoindoline CAS_76727-72-5
TypeSmall organic molecule
Emp. Form.C11H13ClN4
Mol. Mass.236.701
SMILESClc1cccc2-[#6]-[#7](-[#6]-c12)\[#7]=[#6]-1\[#7]-[#6]-[#6]-[#7]-1