Reaction Details
TargetAlpha-2C adrenergic receptor
LigandBDBM66983
Substrate/Competitorn/a
Ki 2.7±n/a nM
CommentsPDSP_1727
Citation Blaxall, HSMurphy, TJBaker, JCRay, CBylund, DB Characterization of the alpha-2C adrenergic receptor subtype in the opossum kidney and in the OK cell line. J Pharmacol Exp Ther259:323-9 (1991) Alpha-2C adrenergic receptor
Name:Alpha-2C adrenergic receptor
Type:Enzyme Catalytic Domain
Mol. Mass.:27257.01
Organism:OK
Description:adrenergic Alpha2C ADRA2C OK::G3GWB4
Residue:230
BDBM66983
NameBDBM66983
Synonyms:6-chloranyl-3-methyl-1,2,4,5-tetrahydro-3-benzazepine;hydrochloride CHEMBL123349 SKF 86466 SMR001254100 | cid_10220250
TypeSmall organic molecule
Emp. Form.C11H14ClN
Mol. Mass.195.689
SMILESCN1CCc2cccc(Cl)c2CC1