Reaction Details
TargetAlpha-2C adrenergic receptor
LigandBDBM50019855
Substrate/Competitorn/a
Ki 0.48±n/a nM
CommentsPDSP_1963
Citation Blaxall, HSMurphy, TJBaker, JCRay, CBylund, DB Characterization of the alpha-2C adrenergic receptor subtype in the opossum kidney and in the OK cell line. J Pharmacol Exp Ther259:323-9 (1991) Alpha-2C adrenergic receptor
Name:Alpha-2C adrenergic receptor
Type:Enzyme Catalytic Domain
Mol. Mass.:27257.01
Organism:OK
Description:adrenergic Alpha2C ADRA2C OK::G3GWB4
Residue:230
BDBM50019855
NameBDBM50019855
Synonyms:2-(4,5-Dihydro-1H-imidazol-2-yl)-5-fluoro-1-methyl-2,3-dihydro-1H-indole WIN 52664
TypeSmall organic molecule
Emp. Form.C12H14FN3
Mol. Mass.219.2581
SMILESCN1C(Cc2cc(F)ccc12)C1=NCCN1