Reaction Details
TargetCalcium release-activated calcium channel protein 1
LigandBDBM16173
Substrate/Competitorn/a
Ki>10000±n/a nM
CommentsPDSP_2650
Citation Garritsen, AIjzerman, APTulp, MTCragoe, EJSoudijn, W Receptor binding profiles of amiloride analogues provide no evidence for a link between receptors and the Na+/H+ exchanger, but indicate a common structure on receptor proteins. J Recept Res11:891-907 (1991) 
 
Calcium release-activated calcium channel protein 1
Name:Calcium release-activated calcium channel protein 1
Type:Protein
Mol. Mass.:32676.63
Organism:Homo sapiens (Human)
Description:Q96D31
Residue:301
BDBM16173
NameBDBM16173
Synonyms:3,5-diamino-6-chloro-N-(diaminomethylene)pyrazinamide;hydrochloride Amiloride CHEMBL945
TypeSmall organic molecule
Emp. Form.C6H8ClN7O
Mol. Mass.229.627
SMILESNC(=N)NC(=O)c1nc(Cl)c(N)nc1N