Reaction Details
TargetPro-thyrotropin-releasing hormone
LigandBDBM16173
Substrate/Competitorn/a
Ki>10000±n/a nM
CommentsPDSP_2650
Citation Garritsen, AIjzerman, APTulp, MTCragoe, EJSoudijn, W Receptor binding profiles of amiloride analogues provide no evidence for a link between receptors and the Na+/H+ exchanger, but indicate a common structure on receptor proteins. J Recept Res11:891-907 (1991) 
 
Pro-thyrotropin-releasing hormone
Name:Pro-thyrotropin-releasing hormone
Type:Enzyme Catalytic Domain
Mol. Mass.:29277.96
Organism:RAT
Description:TRH 0 RAT::P01150
Residue:255
BDBM16173
NameBDBM16173
Synonyms:3,5-diamino-6-chloro-N-(diaminomethylene)pyrazinamide;hydrochloride Amiloride CHEMBL945
TypeSmall organic molecule
Emp. Form.C6H8ClN7O
Mol. Mass.229.627
SMILESNC(=N)NC(=O)c1nc(Cl)c(N)nc1N