Reaction Details
TargetPro-thyrotropin-releasing hormone
LigandBDBM81819
Substrate/Competitorn/a
Ki>10000±n/a nM
CommentsPDSP_2652
Citation Garritsen, AIjzerman, APTulp, MTCragoe, EJSoudijn, W Receptor binding profiles of amiloride analogues provide no evidence for a link between receptors and the Na+/H+ exchanger, but indicate a common structure on receptor proteins. J Recept Res11:891-907 (1991) 
 
Pro-thyrotropin-releasing hormone
Name:Pro-thyrotropin-releasing hormone
Type:Enzyme Catalytic Domain
Mol. Mass.:29277.96
Organism:RAT
Description:TRH 0 RAT::P01150
Residue:255
BDBM81819
NameBDBM81819
Synonyms:Benzamil CHEMBL212579 | NSC_108107
TypeSmall organic molecule
Emp. Form.C13H14ClN7O
Mol. Mass.319.75
SMILESNC(NC(=O)c1nc(Cl)c(N)nc1N)=NCc1ccccc1