Reaction Details
TargetC-C chemokine receptor type 4
LigandBDBM81834
Substrate/Competitorn/a
Meas. Tech.Cell-Based Assay
IC50 2.3e+3±n/a nM
Citation Kuhn, CFBazin, MPhilippe, LZhang, JTylaska, LMiret, JBauer, PH Bipiperidinyl carboxylic acid amides as potent, selective, and functionally active CCR4 antagonists. Chem Biol Drug Des70:268-72 (2007) 
 
C-C chemokine receptor type 4
Name:C-C chemokine receptor type 4
Type:Enzyme
Mol. Mass.:41406.41
Organism:Homo sapiens (Human)
Description:P51679
Residue:360
BDBM81834
NameBDBM81834
Synonyms:Bipiperidinyl carboxylic acid amide, 7
TypeSmall organic molecule
Emp. Form.C26H40ClN5O2
Mol. Mass.490.081
SMILESCC(C)(C)NC(=O)N1CCC(CC1)N1CCCC(C1)C(=O)N1CCN(CC1)c1ccccc1Cl