Reaction Details
TargetC-C chemokine receptor type 4
LigandBDBM81847
Substrate/Competitorn/a
Meas. Tech.Cell-Based Assay
IC50>1.0e+4±n/a nM
Citation Kuhn, CFBazin, MPhilippe, LZhang, JTylaska, LMiret, JBauer, PH Bipiperidinyl carboxylic acid amides as potent, selective, and functionally active CCR4 antagonists. Chem Biol Drug Des70:268-72 (2007) 
 
C-C chemokine receptor type 4
Name:C-C chemokine receptor type 4
Type:Enzyme
Mol. Mass.:41406.41
Organism:Homo sapiens (Human)
Description:P51679
Residue:360
BDBM81847
NameBDBM81847
Synonyms:Bipiperidinyl carboxylic acid amide, 19
TypeSmall organic molecule
Emp. Form.C30H42N6O2
Mol. Mass.518.6935
SMILESCc1cc(C)cc(NC(=O)N2CCC(CC2)N2CCCC(C2)C(=O)N2CCN(CC2)c2cccc(C)n2)c1