Reaction Details
TargetC-C chemokine receptor type 4
LigandBDBM81851
Substrate/Competitorn/a
Meas. Tech.Cell-Based Assay
IC50 9.8e+3±n/a nM
Citation Kuhn, CFBazin, MPhilippe, LZhang, JTylaska, LMiret, JBauer, PH Bipiperidinyl carboxylic acid amides as potent, selective, and functionally active CCR4 antagonists. Chem Biol Drug Des70:268-72 (2007) 
 
C-C chemokine receptor type 4
Name:C-C chemokine receptor type 4
Type:Enzyme
Mol. Mass.:41406.41
Organism:Homo sapiens (Human)
Description:P51679
Residue:360
BDBM81851
NameBDBM81851
Synonyms:Bipiperidinyl carboxylic acid amide, 23
TypeSmall organic molecule
Emp. Form.C30H40N6O4
Mol. Mass.548.6764
SMILESCOC(=O)c1ccccc1NC(=O)N1CCC(CC1)N1CCCC(C1)C(=O)N1CCN(CC1)c1cccc(C)n1