Reaction Details
TargetAlpha-1A adrenergic receptor
LigandBDBM31046
Substrate/Competitorn/a
Ki 111±n/a nM
CommentsPDSP_1479
Citation Lomasney, JWCotecchia, SLorenz, WLeung, WYSchwinn, DAYang-Feng, TLBrownstein, MLefkowitz, RJCaron, MG Molecular cloning and expression of the cDNA for the alpha 1A-adrenergic receptor. The gene for which is located on human chromosome 5. J Biol Chem266:6365-9 (1991) Alpha-1A adrenergic receptor
Name:Alpha-1A adrenergic receptor
Type:Protein
Mol. Mass.:51620.15
Organism:Rattus norvegicus (Rat)
Description:P43140
Residue:466
BDBM31046
NameBDBM31046
Synonyms:3-[4,5-dihydro-1H-imidazol-2-ylmethyl-(4-methylphenyl)amino]phenol;methanesulfonic acid 3-[N-(2-imidazolin-2-ylmethyl)-4-methyl-anilino]phenol;mesylic acid MLS000069487 PHENTOLAMINE MESYLATE cid_5775 | cid_91430
TypeSmall organic molecule
Emp. Form.C17H19N3O
Mol. Mass.281.3523
SMILESCc1ccc(cc1)N(CC1=NCCN1)c1cccc(O)c1