Reaction Details
TargetAlpha-1B adrenergic receptor
LigandBDBM84342
Substrate/Competitorn/a
Ki 4690±n/a nM
CommentsPDSP_238
Citation Lomasney, JWCotecchia, SLorenz, WLeung, WYSchwinn, DAYang-Feng, TLBrownstein, MLefkowitz, RJCaron, MG Molecular cloning and expression of the cDNA for the alpha 1A-adrenergic receptor. The gene for which is located on human chromosome 5. J Biol Chem266:6365-9 (1991) Alpha-1B adrenergic receptor
Name:Alpha-1B adrenergic receptor
Type:G Protein-Coupled Receptor (GPCR)
Mol. Mass.:56606.71
Organism:Rattus norvegicus (rat)
Description:Receptor binding assays were performed using rat cortical membranes.
Residue:515
BDBM84342
NameBDBM84342
Synonyms:4-[1-hydroxy-2-(methylamino)ethyl]benzene-1,2-diol 4-[1-hydroxy-2-(methylamino)ethyl]benzene-1,2-diol;hydrochloride 4-[2-(methylamino)-1-oxidanyl-ethyl]benzene-1,2-diol;hydrochloride EPINEPHRINE MLS001333244 cid_5924
TypeSmall organic molecule
Emp. Form.C9H13NO3
Mol. Mass.183.2044
SMILESCNCC(O)c1ccc(O)c(O)c1