Reaction Details
TargetAlpha-1B adrenergic receptor
LigandBDBM29568
Substrate/Competitorn/a
Ki 0.56±n/a nM
CommentsPDSP_1528
Citation Lomasney, JWCotecchia, SLorenz, WLeung, WYSchwinn, DAYang-Feng, TLBrownstein, MLefkowitz, RJCaron, MG Molecular cloning and expression of the cDNA for the alpha 1A-adrenergic receptor. The gene for which is located on human chromosome 5. J Biol Chem266:6365-9 (1991) Alpha-1B adrenergic receptor
Name:Alpha-1B adrenergic receptor
Type:G Protein-Coupled Receptor (GPCR)
Mol. Mass.:56606.71
Organism:Rattus norvegicus (rat)
Description:Receptor binding assays were performed using rat cortical membranes.
Residue:515
BDBM29568
NameBDBM29568
Synonyms:CHEMBL2 PRAZOSIN HYDROCHLORIDE [3H]-Minipress [3H]-Prazosin
Typeradiolabeled ligand
Emp. Form.C19H21N5O4
Mol. Mass.383.4011
SMILESCOc1cc2nc(nc(N)c2cc1OC)N1CCN(CC1)C(=O)c1ccco1