Reaction Details
Target5-hydroxytryptamine receptor 1B
LigandBDBM50019443
Substrate/Competitorn/a
Ki 5800±n/a nM
CommentsPDSP_1497
Citation Matsumoto, ICombs, MRJones, DJ Characterization of 5-hydroxytryptamine1B receptors in rat spinal cord via [125I]iodocyanopindolol binding and inhibition of [3H]-5-hydroxytryptamine release. J Pharmacol Exp Ther260:614-26 (1992) 5-hydroxytryptamine receptor 1B
Name:5-hydroxytryptamine receptor 1B
Type:Protein
Mol. Mass.:43173.33
Organism:Rattus norvegicus (Rat)
Description:P28564
Residue:386
BDBM50019443
NameBDBM50019443
Synonyms:1-(1H-Indol-4-yloxy)-3-isopropylamino-propan-2-ol 1-(1H-Indol-4-yloxy)-3-isopropylamino-propan-2-ol(pindolol) LB-46 PINDOLOL,(-) VISKAZIDE | VISKEN
TypeSmall organic molecule
Emp. Form.C14H20N2O2
Mol. Mass.248.3208
SMILESCC(C)NCC(O)COc1cccc2[nH]ccc12