Reaction Details
TargetD(1B) dopamine receptor
LigandBDBM81485
Substrate/Competitorn/a
Ki 37±n/a nM
CommentsPDSP_528
Citation Tiberi, MJarvie, KRSilvia, CFalardeau, PGingrich, JAGodinot, NBertrand, LYang-Feng, TLFremeau, RTCaron, MG Cloning, molecular characterization, and chromosomal assignment of a gene encoding a second D1 dopamine receptor subtype: differential expression pattern in rat brain compared with the D1A receptor. Proc Natl Acad Sci U S A88:7491-5 (1991) 
 
D(1B) dopamine receptor
Name:D(1B) dopamine receptor
Type:Enzyme Catalytic Domain
Mol. Mass.:52827.88
Organism:RAT
Description:Dopamine D1B 0 RAT::P25115
Residue:475
BDBM81485
NameBDBM81485
Synonyms:CAS_68751 NSC_68751 | Teflutixol
TypeSmall organic molecule
Emp. Form.C23H26F4N2OS
Mol. Mass.454.524
SMILESOCCN1CCN(CCCC2c3ccc(F)cc3Sc3ccc(cc23)C(F)(F)F)CC1