Reaction Details
TargetD(1B) dopamine receptor
LigandBDBM50004822
Substrate/Competitorn/a
Ki 100±n/a nM
CommentsPDSP_1719
Citation Tiberi, MJarvie, KRSilvia, CFalardeau, PGingrich, JAGodinot, NBertrand, LYang-Feng, TLFremeau, RTCaron, MG Cloning, molecular characterization, and chromosomal assignment of a gene encoding a second D1 dopamine receptor subtype: differential expression pattern in rat brain compared with the D1A receptor. Proc Natl Acad Sci U S A88:7491-5 (1991) 
 
D(1B) dopamine receptor
Name:D(1B) dopamine receptor
Type:Enzyme Catalytic Domain
Mol. Mass.:52827.88
Organism:RAT
Description:Dopamine D1B 0 RAT::P25115
Residue:475
BDBM50004822
NameBDBM50004822
Synonyms:(R)-1-phenyl-2,3,4,5-tetrahydro-1H-benzo[d]azepine-7,8-diol 1-Phenyl-2,3,4,5-tetrahydro-1H-benzo[d]azepine-7,8-diol 7,8-Dihydroxy-1-phenyl-2,3,4,5-tetrahydro-1H-benzo[d]azepinium(R(+)SKF38393) CHEMBL24077 SK&F-383933 SK-383933 SKF 38393 (+)
TypeSmall organic molecule
Emp. Form.C16H17NO2
Mol. Mass.255.3117
SMILESOc1cc2CCNC[C@H](c3ccccc3)c2cc1O