Reaction Details
Target5-hydroxytryptamine receptor 1A/1B/1D/2C
LigandBDBM50013515
Substrate/Competitorn/a
Ki 4500±n/a nM
CommentsPDSP_1590
Citation Voigt, MMLaurie, DJSeeburg, PHBach, A Molecular cloning and characterization of a rat brain cDNA encoding a 5-hydroxytryptamine1B receptor. EMBO J10:4017-23 (1991) 5-hydroxytryptamine receptor 1A/1B/1D/2C
Name:5-hydroxytryptamine receptor 1A/1B/1D/2C
Synonyms:5-HT1
Type:n/a
Mol. Mass.:n/a
Description:TL
Components:This complex has 0 components.
Component 1
Name:5-hydroxytryptamine receptor 1A
Type:n/a
Mol. Mass.:46122.49
Organism:Homo sapiens (Human)
Description:n/a
Residue:422
Component 2
Name:5-hydroxytryptamine receptor 1B
Synonyms:5-HT-1B 5-HT1B 5HT1B_HUMAN HTR1DB Serotonin (5-HT) receptor Serotonin Receptor 1B
Type:G Protein-Coupled Receptor (GPCR)
Mol. Mass.:43579.17
Organism:Homo sapiens (Human)
Description:Receptor binding assays were performed using human clone stably expressed in CHO cells
Residue:390
Component 3
Name:5-hydroxytryptamine receptor 2C
Synonyms:5-HT-2C 5-HT2C-INI 5-HTR2C 5-hydroxytryptamine receptor 2C (5-HT-2C) 5HT-1C HTR1C Serotonin (5-HT3) receptor Serotonin Receptor 2C
Type:G Protein-Coupled Receptor (GPCR)
Mol. Mass.:51836.79
Organism:Homo sapiens (Human)
Description:P28335
Residue:458
Component 4
Name:5-hydroxytryptamine receptor 1D
Synonyms:5-HT-1D 5-HT1D 5HT1D_HUMAN HTR1DA Serotonin (5-HT) receptor | Serotonin Receptor 1D
Type:G Protein-Coupled Receptor (GPCR)
Mol. Mass.:41920.63
Organism:Homo sapiens (Human)
Description:Receptor binding assays were performed using human clone stably expressed in CHO cells.
Residue:377
BDBM50013515
NameBDBM50013515
Synonyms:(+)-yohimbine 17alpha-hydroxyyohimban-16alpha-carboxylic acid methyl ester CORYNANTHINE Quebrachin YOHIMBINE CHLORIDE Yohimbine cid_8969 methyl 17alpha-hydroxyyohimban-16alpha-carboxylate yohimbic acid methyl ester
TypeSmall organic molecule
Emp. Form.C21H26N2O3
Mol. Mass.354.4427
SMILESCOC(=O)[C@H]1[C@@H](O)CC[C@H]2CN3CCc4c([nH]c5ccccc45)[C@@H]3C[C@H]12