Reaction Details
TargetD(2) dopamine receptor
LigandBDBM81774
Substrate/Competitorn/a
Ki 4.8±n/a nM
CommentsPDSP_1785
Citation Van Tol, HHBunzow, JRGuan, HCSunahara, RKSeeman, PNiznik, HBCivelli, O Cloning of the gene for a human dopamine D4 receptor with high affinity for the antipsychotic clozapine. Nature350:610-4 (1991) 
 
D(2) dopamine receptor
Name:D(2) dopamine receptor
Type:G Protein-Coupled Receptor (GPCR)
Mol. Mass.:50931.60
Organism:Rattus norvegicus (rat)
Description:P61169
Residue:444
BDBM81774
NameBDBM81774
Synonyms:CAS_15676-16-1 Sulpiride-S | Sulpiride-l
Typen/a
Emp. Form.C15H23N3O4S
Mol. Mass.341.426
SMILESCCN1CCC[C@H]1CNC(=O)c1cc(ccc1OC)S(N)(=O)=O