Reaction Details
TargetDopamine receptor D4
LigandBDBM50005120
Substrate/Competitorn/a
Ki 0.06±n/a nM
CommentsPDSP_1981
Citation Van Tol, HHBunzow, JRGuan, HCSunahara, RKSeeman, PNiznik, HBCivelli, O Cloning of the gene for a human dopamine D4 receptor with high affinity for the antipsychotic clozapine. Nature350:610-4 (1991) 
 
Dopamine receptor D4
Name:Dopamine receptor D4
Type:Enzyme Catalytic Domain
Mol. Mass.:43731.97
Organism:CANINE
Description:Q589Y6
Residue:421
BDBM50005120
NameBDBM50005120
Synonyms:CHEMBL274491 N-(1-Benzyl-2-methyl-pyrrolidin-3-yl)-5-chloro-2-methoxy-4-methylamino-benzamide YM-09151-2
TypeSmall organic molecule
Emp. Form.C21H26ClN3O2
Mol. Mass.387.903
SMILESCNc1cc(OC)c(cc1Cl)C(=O)N[C@H]1CCN(Cc2ccccc2)[C@H]1C