Reaction Details
TargetDopamine receptor D4
LigandBDBM81872
Substrate/Competitorn/a
Ki 109±n/a nM
CommentsPDSP_794
Citation Van Tol, HHBunzow, JRGuan, HCSunahara, RKSeeman, PNiznik, HBCivelli, O Cloning of the gene for a human dopamine D4 receptor with high affinity for the antipsychotic clozapine. Nature350:610-4 (1991) 
 
Dopamine receptor D4
Name:Dopamine receptor D4
Type:Enzyme Catalytic Domain
Mol. Mass.:43731.97
Organism:CANINE
Description:Q589Y6
Residue:421
BDBM81872
NameBDBM81872
Synonyms:CAS_161309 NSC_161309
TypeSmall organic molecule
Emp. Form.C32H41N5O5
Mol. Mass.575.6984
SMILESCCC(C)C1N2C(=O)C(NC(=O)C3CN(C)C4Cc5c[nH]c6cccc(C4=C3)c56)(OC2(O)C2CCCN2C1=O)C(C)C