Reaction Details
TargetBeta-1 adrenergic receptor
LigandBDBM25758
Substrate/Competitorn/a
Ki 12.02±n/a nM
CommentsPDSP_1057
Citation Tsuchihashi, HNakashima, YKinami, JNagatomo, T Characteristics of 125I-iodocyanopindolol binding to beta-adrenergic and serotonin-1B receptors of rat brain: selectivity of beta-adrenergic agents. Jpn J Pharmacol52:195-200 (1990) 
 
Beta-1 adrenergic receptor
Name:Beta-1 adrenergic receptor
Type:Protein
Mol. Mass.:50486.84
Organism:Rattus norvegicus (Rat)
Description:P18090
Residue:466
BDBM25758
NameBDBM25758
Synonyms:2-hydroxy-5-{1-hydroxy-2-[(4-phenylbutan-2-yl)amino]ethyl}benzamide Labetolol labetalol
TypeSmall organic molecule
Emp. Form.C19H24N2O3
Mol. Mass.328.4055
SMILESCC(CCc1ccccc1)NCC(O)c1ccc(O)c(c1)C(N)=O