Reaction Details
TargetBeta-1 adrenergic receptor
LigandBDBM81882
Substrate/Competitorn/a
Ki 4.37±n/a nM
CommentsPDSP_6654
Citation Tsuchihashi, HNakashima, YKinami, JNagatomo, T Characteristics of 125I-iodocyanopindolol binding to beta-adrenergic and serotonin-1B receptors of rat brain: selectivity of beta-adrenergic agents. Jpn J Pharmacol52:195-200 (1990) 
 
Beta-1 adrenergic receptor
Name:Beta-1 adrenergic receptor
Type:Protein
Mol. Mass.:50486.84
Organism:Rattus norvegicus (Rat)
Description:P18090
Residue:466
BDBM81882
NameBDBM81882
Synonyms:CAS_93633-92-2 | YM-09538
TypeSmall organic molecule
Emp. Form.C18H24N2O5S
Mol. Mass.380.459
SMILESCOc1ccccc1OCCNCC(O)c1ccc(C)c(c1)S(N)(=O)=O