Reaction Details
TargetBeta-2 adrenergic receptor
LigandBDBM81885
Substrate/Competitorn/a
Ki 0.55±n/a nM
CommentsPDSP_6651
Citation Tsuchihashi, HNakashima, YKinami, JNagatomo, T Characteristics of 125I-iodocyanopindolol binding to beta-adrenergic and serotonin-1B receptors of rat brain: selectivity of beta-adrenergic agents. Jpn J Pharmacol52:195-200 (1990) 
 
Beta-2 adrenergic receptor
Name:Beta-2 adrenergic receptor
Type:PROTEIN
Mol. Mass.:46896.26
Organism:Rattus norvegicus
Description:ChEMBL_38603
Residue:418
BDBM81885
NameBDBM81885
Synonyms:2-(3-tert-Butylamino-2-hydroxypropylthio)-4-(5-carbamoyl-2-thienyl)thiazole CAS_52560-77-7
TypeSmall organic molecule
Emp. Form.C15H21N3O2S3
Mol. Mass.371.541
SMILESCC(C)(C)NCC(O)CSc1nc(cs1)-c1ccc(s1)C(N)=O