Reaction Details
TargetBeta-2 adrenergic receptor
LigandBDBM25752
Substrate/Competitorn/a
Ki 2041.74±n/a nM
CommentsPDSP_360
Citation Tsuchihashi, HNakashima, YKinami, JNagatomo, T Characteristics of 125I-iodocyanopindolol binding to beta-adrenergic and serotonin-1B receptors of rat brain: selectivity of beta-adrenergic agents. Jpn J Pharmacol52:195-200 (1990) 
 
Beta-2 adrenergic receptor
Name:Beta-2 adrenergic receptor
Type:PROTEIN
Mol. Mass.:46896.26
Organism:Rattus norvegicus
Description:ChEMBL_38603
Residue:418
BDBM25752
NameBDBM25752
Synonyms:Betaxolol [(2S)-3-{4-[2-(cyclopropylmethoxy)ethyl]phenoxy}-2-hydroxypropyl](propan-2-yl)amine
TypeSmall organic molecule
Emp. Form.C18H29NO3
Mol. Mass.307.4278
SMILESCC(C)NC[C@H](O)COc1ccc(CCOCC2CC2)cc1