Reaction Details
TargetBeta-2 adrenergic receptor
LigandBDBM81884
Substrate/Competitorn/a
Ki>10000±n/a nM
CommentsPDSP_6658
Citation Tsuchihashi, HNakashima, YKinami, JNagatomo, T Characteristics of 125I-iodocyanopindolol binding to beta-adrenergic and serotonin-1B receptors of rat brain: selectivity of beta-adrenergic agents. Jpn J Pharmacol52:195-200 (1990) 
 
Beta-2 adrenergic receptor
Name:Beta-2 adrenergic receptor
Type:PROTEIN
Mol. Mass.:46896.26
Organism:Rattus norvegicus
Description:ChEMBL_38603
Residue:418
BDBM81884
NameBDBM81884
Synonyms:d-Metoprolol
TypeSmall organic molecule
Emp. Form.C15H25NO3
Mol. Mass.267.3639
SMILESCOCCc1ccc(OC[C@H](O)CNC(C)C)cc1