Reaction Details
TargetBeta-2 adrenergic receptor
LigandBDBM25758
Substrate/Competitorn/a
Ki 67.61±n/a nM
CommentsPDSP_1057
Citation Tsuchihashi, HNakashima, YKinami, JNagatomo, T Characteristics of 125I-iodocyanopindolol binding to beta-adrenergic and serotonin-1B receptors of rat brain: selectivity of beta-adrenergic agents. Jpn J Pharmacol52:195-200 (1990) 
 
Beta-2 adrenergic receptor
Name:Beta-2 adrenergic receptor
Type:PROTEIN
Mol. Mass.:46896.26
Organism:Rattus norvegicus
Description:ChEMBL_38603
Residue:418
BDBM25758
NameBDBM25758
Synonyms:2-hydroxy-5-{1-hydroxy-2-[(4-phenylbutan-2-yl)amino]ethyl}benzamide Labetolol labetalol
TypeSmall organic molecule
Emp. Form.C19H24N2O3
Mol. Mass.328.4055
SMILESCC(CCc1ccccc1)NCC(O)c1ccc(O)c(c1)C(N)=O