Reaction Details
TargetD(3) dopamine receptor
LigandBDBM81793
Substrate/Competitorn/a
Ki 1.7±n/a nM
CommentsPDSP_1848
Citation Sokoloff, PGiros, BMartres, MPBouthenet, MLSchwartz, JC Molecular cloning and characterization of a novel dopamine receptor (D3) as a target for neuroleptics. Nature347:146-51 (1990) 
 
D(3) dopamine receptor
Name:D(3) dopamine receptor
Type:Protein
Mol. Mass.:49540.58
Organism:Rattus norvegicus (Rat)
Description:P19020
Residue:446
BDBM81793
NameBDBM81793
Synonyms:CAS_316-81-4 Thioproperazine
TypeSmall organic molecule
Emp. Form.C22H30N4O2S2
Mol. Mass.446.629
SMILESCN(C)S(=O)(=O)c1ccc2Sc3ccccc3N(CCCN3CCN(C)CC3)c2c1