Reaction Details
TargetBeta-1 adrenergic receptor
LigandBDBM50035057
Substrate/Competitorn/a
Ki 420±n/a nM
CommentsPDSP_779
Citation Schipper, JTulp, MTSijbesma, H Neurochemical profile of eltoprazine. Drug Metabol Drug Interact8:85-114 (1990) 
 
Beta-1 adrenergic receptor
Name:Beta-1 adrenergic receptor
Type:Protein
Mol. Mass.:50486.84
Organism:Rattus norvegicus (Rat)
Description:P18090
Residue:466
BDBM50035057
NameBDBM50035057
Synonyms:(eltoprazine)1-(2,3-Dihydro-benzo[1,4]dioxin-5-yl)-piperazine CHEMBL282614 | Eltoprazine
TypeSmall organic molecule
Emp. Form.C12H16N2O2
Mol. Mass.220.2676
SMILESC1CN(CCN1)c1cccc2OCCOc12