Reaction Details
TargetMuscarinic acetylcholine receptor M2
LigandBDBM50035057
Substrate/Competitorn/a
Ki>10000±n/a nM
CommentsPDSP_779
Citation Schipper, JTulp, MTSijbesma, H Neurochemical profile of eltoprazine. Drug Metabol Drug Interact8:85-114 (1990) 
 
Muscarinic acetylcholine receptor M2
Name:Muscarinic acetylcholine receptor M2
Type:Enzyme Catalytic Domain
Mol. Mass.:51555.53
Organism:RAT
Description:P10980
Residue:466
BDBM50035057
NameBDBM50035057
Synonyms:(eltoprazine)1-(2,3-Dihydro-benzo[1,4]dioxin-5-yl)-piperazine CHEMBL282614 | Eltoprazine
TypeSmall organic molecule
Emp. Form.C12H16N2O2
Mol. Mass.220.2676
SMILESC1CN(CCN1)c1cccc2OCCOc12