Reaction Details
TargetOxytocin receptor
LigandBDBM81892
Substrate/Competitorn/a
Ki 13±n/a nM
CommentsPDSP_1041
Citation Pettibone, DJClineschmidt, BVLis, EVReiss, DRTotaro, JAWoyden, CJBock, MGFreidinger, RMTung, RDVeber, DF In vitro pharmacological profile of a novel structural class of oxytocin antagonists. J Pharmacol Exp Ther256:304-8 (1991) Oxytocin receptor
Name:Oxytocin receptor
Type:Enzyme Catalytic Domain
Mol. Mass.:42889.28
Organism:RAT
Description:Oxytocin OXTR RAT::P70536
Residue:388
BDBM81892
NameBDBM81892
Synonyms:Cyclo[L-Pro-D-Phe-L-Ile-1,6-didehydro-D-Pyz-N-methyl-D-Phe-] L-366,706
TypeSmall organic molecule
Emp. Form.C35H44N6O5
Mol. Mass.628.7611
SMILESCCC(C)C1NC(=O)[C@H](Cc2ccccc2)NC(=O)[C@H]2CCCN2C(=O)C(Cc2ccccc2)N(C)C(=O)[C@H]2CCC=NN2C1=O