Reaction Details
TargetMuscarinic acetylcholine receptor M1
LigandBDBM81462
Substrate/Competitorn/a
Ki 0.37±n/a nM
CommentsPDSP_2389
Citation Dörje, FWess, JLambrecht, GTacke, RMutschler, EBrann, MR Antagonist binding profiles of five cloned human muscarinic receptor subtypes. J Pharmacol Exp Ther256:727-33 (1991) Muscarinic acetylcholine receptor M1
Name:Muscarinic acetylcholine receptor M1
Type:Protein
Mol. Mass.:51442.54
Organism:Homo sapiens (Human)
Description:P11229
Residue:460
BDBM81462
NameBDBM81462
Synonyms:(R)-Trihexyphenidyl Benzhexol NSC_5572 Trihexyphenidyl
TypeSmall organic molecule
Emp. Form.C20H31NO
Mol. Mass.301.4662
SMILESOC(CCN1CCCCC1)(C1CCCCC1)c1ccccc1