Reaction Details
TargetMuscarinic acetylcholine receptor M1
LigandBDBM81898
Substrate/Competitorn/a
Ki 26.30±n/a nM
CommentsPDSP_2384
Citation Dörje, FWess, JLambrecht, GTacke, RMutschler, EBrann, MR Antagonist binding profiles of five cloned human muscarinic receptor subtypes. J Pharmacol Exp Ther256:727-33 (1991) Muscarinic acetylcholine receptor M1
Name:Muscarinic acetylcholine receptor M1
Type:Protein
Mol. Mass.:51442.54
Organism:Homo sapiens (Human)
Description:P11229
Residue:460
BDBM81898
NameBDBM81898
Synonyms:(R)-Hexbutinol CAS_2054312 NSC_2054312 | NSC_2054314
TypeSmall organic molecule
Emp. Form.C21H29NO
Mol. Mass.311.4611
SMILESOC(C#CCN1CCCCC1)(C1CCCCC1)c1ccccc1