Reaction Details
TargetMuscarinic acetylcholine receptor M3
LigandBDBM81900
Substrate/Competitorn/a
Ki 63.10±n/a nM
CommentsPDSP_2387
Citation Dörje, FWess, JLambrecht, GTacke, RMutschler, EBrann, MR Antagonist binding profiles of five cloned human muscarinic receptor subtypes. J Pharmacol Exp Ther256:727-33 (1991) Muscarinic acetylcholine receptor M3
Name:Muscarinic acetylcholine receptor M3
Type:Enzyme
Mol. Mass.:66151.03
Organism:Homo sapiens (Human)
Description:P20309
Residue:590
BDBM81900
NameBDBM81900
Synonyms:AQ-RA 741 NSC_129989
TypeSmall organic molecule
Emp. Form.C27H37N5O2
Mol. Mass.463.615
SMILESCCN(CC)CCCCC1CCN(CC(=O)N2c3ccccc3C(=O)Nc3cccnc23)CC1