Reaction Details
TargetMuscarinic acetylcholine receptor M5
LigandBDBM81898
Substrate/Competitorn/a
Ki 75.86±n/a nM
CommentsPDSP_2384
Citation Dörje, FWess, JLambrecht, GTacke, RMutschler, EBrann, MR Antagonist binding profiles of five cloned human muscarinic receptor subtypes. J Pharmacol Exp Ther256:727-33 (1991) Muscarinic acetylcholine receptor M5
Name:Muscarinic acetylcholine receptor M5
Type:PROTEIN
Mol. Mass.:60102.35
Organism:Homo sapiens (Human)
Description:ChEMBL_1517990
Residue:532
BDBM81898
NameBDBM81898
Synonyms:(R)-Hexbutinol CAS_2054312 NSC_2054312 | NSC_2054314
TypeSmall organic molecule
Emp. Form.C21H29NO
Mol. Mass.311.4611
SMILESOC(C#CCN1CCCCC1)(C1CCCCC1)c1ccccc1