Reaction Details
TargetCarboxypeptidase B2
LigandBDBM81904
Substrate/Competitorn/a
Meas. Tech.Inhibition Assay
Ki 3.2e+4±n/a nM
Citation Fernández, DAvilés, FXVendrell, J Aromatic organic compounds as scaffolds for metallocarboxypeptidase inhibitor design. Chem Biol Drug Des73:75-82 (2009) 
 
Carboxypeptidase B2
Name:Carboxypeptidase B2
Type:Enzyme
Mol. Mass.:48432.74
Organism:Homo sapiens (Human)
Description:Q96IY4
Residue:423
BDBM81904
NameBDBM81904
Synonyms:1-(3,4-dihydroisoquinolin-2(1H)-yl)-2-(5thiophen-2-yl)-2H-tetrazol-2-yl)ethanone, 3
TypeSmall organic molecule
Emp. Form.C16H15N5OS
Mol. Mass.325.388
SMILESO=C(Cn1nnc(n1)-c1cccs1)N1CCc2ccccc2C1